BDBM476500 (2S)-N-(3-chlorobenzyl)-4-(4,4- dimethyl-5-phenyl-4,5-dihydro-1,3- oxazol-2-yl)-1-(6-piperidin-1-yl-D- norleucyl)piperazine-2-carboxamide::US10875851, Example 156
SMILES CC1(C)N=C(OC1c1ccccc1)N1CCN([C@@H](C1)C(=O)NCc1cccc(Cl)c1)C(=O)[C@H](N)CCCCN1CCCCC1
InChI Key InChIKey=CALSYGMYGLXIHX-RAVAVGQKSA-N
Data  1 IC50
  Tab Delimited (TSV)   2D SDfile   Computed 3D by Vconf -m prep SDfile
Find this compound or compounds like it in BindingDB:
Activity Spreadsheet -- Enzyme Inhibition Constant Data from BindingDB
Found 1 hit for monomerid = 476500
TargetCoagulation factor XII(Homo sapiens (Human))
Merck Sharp & Dohme
US Patent
LigandPNGBDBM476500((2S)-N-(3-chlorobenzyl)-4-(4,4- dimethyl-5-phenyl-...)
Affinity DataIC50:  52.3nM. Assay description: The effectiveness of a compound of the present invention as an inhibitor of Coagulation Factor XIIa can be determined using a relevant purified serin...
Ligand InfoPC cidPC sid
In DepthDetails US Patent