BDBM47652 1-[[5,7-bis(bromanyl)-2-oxidanylidene-indol-3-yl]amino]thiourea::MLS000713857::SMR000273338::[(5,7-dibromo-2-keto-indol-3-yl)amino]thiourea::[(5,7-dibromo-2-oxo-3-indolyl)amino]thiourea::[(5,7-dibromo-2-oxoindol-3-yl)amino]thiourea::cid_5443722
SMILES NC(=S)NNC1=c2cc(Br)cc(Br)c2=NC1=O
InChI Key InChIKey=ZRMKNSRYBAOYPI-UHFFFAOYSA-N
Data  1 EC50
  Tab Delimited (TSV)   2D SDfile   Computed 3D by Vconf -m prep SDfile
Find this compound or compounds like it in BindingDB:
Activity Spreadsheet -- Enzyme Inhibition Constant Data from BindingDB
Found 1 hit for monomerid = 47652
TargetGlutathione S-transferase Mu 1(Homo sapiens (Human))
Nmmlsc
Curated by PubChem BioAssay
LigandPNGBDBM47652(1-[[5,7-bis(bromanyl)-2-oxidanylidene-indol-3-yl]a...)
Affinity DataEC50:  6.91E+4nM. Assay description: University of New Mexico Assay Overview: Assay Support: NIH I RO3 MH081231-01 HTS to identify specific small molecule inhibitors of Ras and Ras-re...
In DepthDetails PCBioAssay