BDBM47661 MLS000716772::SMR000278289::cid_4887504
SMILES Nc1nc(=O)c2C(C3=C(Nc2[nH]1)c1ccccc1C3=O)c1cccc2ccccc12
InChI Key InChIKey=REFRXJLVZLYWFD-UHFFFAOYSA-N
Data  1 IC50  1 EC50
  Tab Delimited (TSV)   2D SDfile   Computed 3D by Vconf -m prep SDfile
Find this compound or compounds like it in BindingDB:
Activity Spreadsheet -- Enzyme Inhibition Constant Data from BindingDB
Found 2 hits for monomerid = 47661
TargetInduced myeloid leukemia cell differentiation protein Mcl-1(Homo sapiens (Human))
Emory University
Curated by PubChem BioAssay
LigandPNGBDBM47661(MLS000716772 | SMR000278289 | cid_4887504)
Affinity DataIC50:  3.73E+3nM. Assay description: NIH Molecular Libraries Screening Centers Network [MLSCN] Emory Chemical Biology Discovery Center in MLSCN Assay provider: Nikolovska-Coleska, Univer...
In DepthDetails PCBioAssay
TargetGlutathione S-transferase Mu 1(Homo sapiens (Human))
Nmmlsc
Curated by PubChem BioAssay
LigandPNGBDBM47661(MLS000716772 | SMR000278289 | cid_4887504)
Affinity DataEC50:  2.59E+3nM. Assay description: University of New Mexico Assay Overview: Assay Support: NIH I RO3 MH081231-01 HTS to identify specific small molecule inhibitors of Ras and Ras-re...
In DepthDetails PCBioAssay