BDBM476623 N-(4-(2- (cyclobutylmethyl)hydrazine- 1-carbonyl)benzyl)benzamide::US10870618, Compound 2m
SMILES O=C(NCc1ccc(cc1)C(=O)NNCC1CCC1)c1ccccc1
InChI Key InChIKey=ATSFDDFEGSROQL-UHFFFAOYSA-N
Data  3 IC50
  Tab Delimited (TSV)   2D SDfile   Computed 3D by Vconf -m prep SDfile
Find this compound or compounds like it in BindingDB:
Activity Spreadsheet -- Enzyme Inhibition Constant Data from BindingDB
Found 3 hits for monomerid = 476623
TargetHistone deacetylase 3(Homo sapiens (Human))
Musc Foundation For Research Development
US Patent
LigandPNGBDBM476623(N-(4-(2- (cyclobutylmethyl)hydrazine- 1-carbonyl)b...)
Affinity DataIC50:  84.4nM. Assay description: Recombinant HDACs 1, 2, and 3 (BPS Biosciences) were diluted to a concentration of 1 nM in HDAC buffer. 10 uL of this solution was added in 96-well f...
Ligand InfoPC cidPC sid
In DepthDetails US Patent
TargetHistone deacetylase 3(Homo sapiens (Human))
Musc Foundation For Research Development
US Patent
LigandPNGBDBM476623(N-(4-(2- (cyclobutylmethyl)hydrazine- 1-carbonyl)b...)
Affinity DataIC50:  1.88E+3nM. Assay description: Allosteric inhibition of HDAC3 in HEK293 cell lysates pre-incubated for 2 hrs before acetylated lysine-aminomethyl coumarin-BOC addition and measured...
Ligand InfoPC cidPC sid
In DepthDetails ArticlePubMed
TargetHistone deacetylase 3(Homo sapiens (Human))
Musc Foundation For Research Development
US Patent
LigandPNGBDBM476623(N-(4-(2- (cyclobutylmethyl)hydrazine- 1-carbonyl)b...)
Affinity DataIC50:  84nM. Assay description: Allosteric inhibition of C-terminal His-tagged recombinant human HDAC3 expressed in Sf9 cells pre-incubated for 2 hrs before acetylated lysine-aminom...
Ligand InfoPC cidPC sid
In DepthDetails ArticlePubMed