BDBM476714 US10870651, Compound 106
SMILES CN(C)CCNC(=O)N1Cc2c(Nc3cccc(NC(=O)c4ccc(NC(=O)C=C)cc4)c3)n[nH]c2C1(C)C
InChI Key InChIKey=FYSDPHKGVBRASN-UHFFFAOYSA-N
Data  2 IC50
  Tab Delimited (TSV)   2D SDfile   Computed 3D by Vconf -m prep SDfile
Find this compound or compounds like it in BindingDB:
Activity Spreadsheet -- Enzyme Inhibition Constant Data from BindingDB
Found 2 hits for monomerid = 476714
TargetCDK-activating kinase assembly factor MAT1/Cyclin-H/Cyclin-dependent kinase 7(Homo sapiens (Human))
Dana-Farber Cancer Institute
US Patent
LigandPNGBDBM476714(US10870651, Compound 106)
Affinity DataIC50:  300nM. Assay description: Compounds of the invention were assayed for activity against a variety of different kinases.
Ligand InfoPC cidPC sid
In DepthDetails US Patent
TargetMaternal embryonic leucine zipper kinase(Homo sapiens (Human))
Dana-Farber Cancer Institute
US Patent
LigandPNGBDBM476714(US10870651, Compound 106)
Affinity DataIC50:  550nM. Assay description: Compounds of the invention were assayed for activity against a variety of different kinases.
Ligand InfoPC cidPC sid
In DepthDetails US Patent