BDBM476724 US10870651, Compound 112
SMILES CN(C)C[C@@H](NC(=O)N1Cc2c(NC(=O)c3cccc(NC(=O)c4ccc(NC(=O)C=C)cc4)c3)n[nH]c2C1(C)C)c1ccccc1
InChI Key
Data  1 IC50
  Tab Delimited (TSV)   2D SDfile   Computed 3D by Vconf -m prep SDfile
Find this compound or compounds like it in BindingDB:
Activity Spreadsheet -- Enzyme Inhibition Constant Data from BindingDB
Found 1 hit for monomerid = 476724
TargetCDK-activating kinase assembly factor MAT1/Cyclin-H/Cyclin-dependent kinase 7(Homo sapiens (Human))
Dana-Farber Cancer Institute
US Patent
LigandPNGBDBM476724(US10870651, Compound 112)
Affinity DataIC50: <100nM. Assay description: Compounds of the invention were assayed for activity against a variety of different kinases.
Ligand InfoPC cidPC sid
In DepthDetails US Patent