BDBM47676 (4E)-4-[[4-[ethyl(isopropyl)amino]anilino]methylene]-2-p-anisyl-isoquinoline-1,3-quinone::(4E)-4-[[4-[ethyl(propan-2-yl)amino]anilino]methylidene]-2-[(4-methoxyphenyl)methyl]isoquinoline-1,3-dione::(4E)-4-[[[4-[ethyl(propan-2-yl)amino]phenyl]amino]methylidene]-2-[(4-methoxyphenyl)methyl]isoquinoline-1,3-dione::MLS000771893::SMR000344239::cid_6217620
SMILES CCN(C(C)C)c1ccc(NC=C2C(=O)N(Cc3ccc(OC)cc3)C(=O)c3ccccc23)cc1
InChI Key InChIKey=SBRSDPYJAXOXSF-UHFFFAOYSA-N
Data  1 IC50  2 EC50
  Tab Delimited (TSV)   2D SDfile   Computed 3D by Vconf -m prep SDfile
Find this compound or compounds like it in BindingDB:
Activity Spreadsheet -- Enzyme Inhibition Constant Data from BindingDB
Found 3 hits for monomerid = 47676
TargetGlutathione S-transferase Mu 1(Homo sapiens (Human))
Nmmlsc
Curated by PubChem BioAssay
LigandPNGBDBM47676((4E)-4-[[4-[ethyl(isopropyl)amino]anilino]methylen...)
Affinity DataEC50:  249nM. Assay description: University of New Mexico Assay Overview: Assay Support: NIH I RO3 MH081231-01 HTS to identify specific small molecule inhibitors of Ras and Ras-re...
In DepthDetails PCBioAssay
TargetG-protein coupled receptor 55(Homo sapiens (Human))
Burnham Center For Chemical Genomics
Curated by PubChem BioAssay
LigandPNGBDBM47676((4E)-4-[[4-[ethyl(isopropyl)amino]anilino]methylen...)
Affinity DataEC50:  2.01E+3nM. Assay description: Data Source: Sanford-Burnham Center for Chemical Genomics (SBCCG) Source Affiliation: Sanford-Burnham Medical Research Institute (SBMRI, San Diego, C...
In DepthDetails PCBioAssay
TargetGlycoprotein 42(Human herpesvirus 4 type 2)
Emory University
Curated by PubChem BioAssay
LigandPNGBDBM47676((4E)-4-[[4-[ethyl(isopropyl)amino]anilino]methylen...)
Affinity DataIC50:  3.10E+3nM. Assay description: NIH Molecular Libraries Screening Centers Network [MLSCN] Emory Chemical Biology Discovery Center in MLSCN Assay provider: Theodore Jardetzky; Northw...
In DepthDetails PCBioAssay