BDBM476769 US10870660, Compound III-102::US11345716, Compound III-102
SMILES Cn1cc(CC(=O)N[C@H]2CC[C@](F)(CCN3CCc4ccc(OCC(F)(F)F)nc4CC3)CC2)cn1
InChI Key InChIKey=XDIPGTFTRLCMJN-RZJSWYKGSA-N
Data  4 KI
  Tab Delimited (TSV)   2D SDfile   Computed 3D by Vconf -m prep SDfile
Find this compound or compounds like it in BindingDB:
Activity Spreadsheet -- Enzyme Inhibition Constant Data from BindingDB
Found 4 hits for monomerid = 476769
TargetD(3) dopamine receptor(Homo sapiens (Human))
Shionogi
US Patent
LigandPNGBDBM476769(US10870660, Compound III-102 | US11345716, Compoun...)
Affinity DataKi:  0.110nM. Assay description: 225 nL of the solutions of the non-specific ligand or the compounds of the present invention at each concentration (in case of vehicle, final concent...
Ligand InfoPC cidPC sid
In DepthDetails US Patent
TargetD(3) dopamine receptor(Homo sapiens (Human))
Shionogi
US Patent
LigandPNGBDBM476769(US10870660, Compound III-102 | US11345716, Compoun...)
Affinity DataKi:  0.110nM. Assay description: 225 nL of the solutions of the non-specific ligand or the compounds of the present invention at each concentration (in case of vehicle, final concent...
Ligand InfoPC cidPC sid
TargetD(2) dopamine receptor(Homo sapiens (Human))
Shionogi
US Patent
LigandPNGBDBM476769(US10870660, Compound III-102 | US11345716, Compoun...)
Affinity DataKi:  400nM. Assay description: 225 nL of the solutions of the non-specific ligand or the compounds of the present invention at each concentration (in case of vehicle, final concent...
Ligand InfoPC cidPC sid
TargetD(2) dopamine receptor(Homo sapiens (Human))
Shionogi
US Patent
LigandPNGBDBM476769(US10870660, Compound III-102 | US11345716, Compoun...)
Affinity DataKi:  400nM. Assay description: 225 nL of the solutions of the non-specific ligand or the compounds of the present invention at each concentration (in case of vehicle, final concent...
Ligand InfoPC cidPC sid
In DepthDetails US Patent