BDBM476772 US10870660, Compound III-128::US11345716, Compound III-128
SMILES Cn1c(cccc1=O)C(=O)N[C@H]1CC[C@H](CCN2CCc3nc(OCC(F)(F)F)sc3CC2)CC1
InChI Key InChIKey=IUDLGCVTTLUKGF-QAQDUYKDSA-N
Data  4 KI
  Tab Delimited (TSV)   2D SDfile   Computed 3D by Vconf -m prep SDfile
Find this compound or compounds like it in BindingDB:
Activity Spreadsheet -- Enzyme Inhibition Constant Data from BindingDB
Found 4 hits for monomerid = 476772
TargetD(3) dopamine receptor(Homo sapiens (Human))
Shionogi
US Patent
LigandPNGBDBM476772(US10870660, Compound III-128 | US11345716, Compoun...)
Affinity DataKi:  0.120nM. Assay description: 225 nL of the solutions of the non-specific ligand or the compounds of the present invention at each concentration (in case of vehicle, final concent...
Ligand InfoPC cidPC sid
In DepthDetails US Patent
TargetD(3) dopamine receptor(Homo sapiens (Human))
Shionogi
US Patent
LigandPNGBDBM476772(US10870660, Compound III-128 | US11345716, Compoun...)
Affinity DataKi:  0.120nM. Assay description: 225 nL of the solutions of the non-specific ligand or the compounds of the present invention at each concentration (in case of vehicle, final concent...
Ligand InfoPC cidPC sid
TargetD(2) dopamine receptor(Homo sapiens (Human))
Shionogi
US Patent
LigandPNGBDBM476772(US10870660, Compound III-128 | US11345716, Compoun...)
Affinity DataKi:  370nM. Assay description: 225 nL of the solutions of the non-specific ligand or the compounds of the present invention at each concentration (in case of vehicle, final concent...
Ligand InfoPC cidPC sid
TargetD(2) dopamine receptor(Homo sapiens (Human))
Shionogi
US Patent
LigandPNGBDBM476772(US10870660, Compound III-128 | US11345716, Compoun...)
Affinity DataKi:  370nM. Assay description: 225 nL of the solutions of the non-specific ligand or the compounds of the present invention at each concentration (in case of vehicle, final concent...
Ligand InfoPC cidPC sid
In DepthDetails US Patent