BDBM47678 2-[2-(2-fluoranylphenoxy)ethylsulfanyl]-3-methyl-quinazolin-4-one::2-[2-(2-fluorophenoxy)ethylsulfanyl]-3-methylquinazolin-4-one::2-[2-(2-fluorophenoxy)ethylthio]-3-methyl-4-quinazolinone::2-[2-(2-fluorophenoxy)ethylthio]-3-methyl-quinazolin-4-one::MLS000772294::SMR000344349::cid_5136372
SMILES Cn1c(SCCOc2ccccc2F)nc2ccccc2c1=O
InChI Key InChIKey=TVTAVFJSSSRAJC-UHFFFAOYSA-N
Data  1 EC50
  Tab Delimited (TSV)   2D SDfile   Computed 3D by Vconf -m prep SDfile
Find this compound or compounds like it in BindingDB:
Activity Spreadsheet -- Enzyme Inhibition Constant Data from BindingDB
Found 1 hit for monomerid = 47678
TargetGlutathione S-transferase Mu 1(Homo sapiens (Human))
Nmmlsc
Curated by PubChem BioAssay
LigandPNGBDBM47678(2-[2-(2-fluoranylphenoxy)ethylsulfanyl]-3-methyl-q...)
Affinity DataEC50:  4.72E+3nM. Assay description: University of New Mexico Assay Overview: Assay Support: NIH I RO3 MH081231-01 HTS to identify specific small molecule inhibitors of Ras and Ras-re...
In DepthDetails PCBioAssay