BDBM476803 US10870641, Example 79B::US10870641, Example 79C::US10870641, Example 79D::US11014913, Example 79C
SMILES FC(F)(F)c1c(cn[nH]c1=O)N1Cc2ccccc2[C@@H]1COC\C=C\C(=O)N1CCN(CC1)c1ccc(cn1)C#N
InChI Key
Data  5 IC50
  Tab Delimited (TSV)   2D SDfile   Computed 3D by Vconf -m prep SDfile
Find this compound or compounds like it in BindingDB:
Activity Spreadsheet -- Enzyme Inhibition Constant Data from BindingDB
Found 5 hits for monomerid = 476803
TargetProtein mono-ADP-ribosyltransferase TIPARP(Human)
Ribon Therapeutics
US Patent
LigandPNGBDBM476803(US10870641, Example 79B | US10870641, Example 79C ...)
Affinity DataIC50: <100nM. Assay description: Displacement of Probe A, a biotinylated probe binding to the TIPARP active site, was measured using a time-resolved fluorescence energy transfer (TR-...
Ligand InfoPC cidPC sid
In DepthDetails US Patent
TargetProtein mono-ADP-ribosyltransferase TIPARP(Human)
Ribon Therapeutics
US Patent
LigandPNGBDBM476803(US10870641, Example 79B | US10870641, Example 79C ...)
Affinity DataIC50: <100nM. Assay description: Displacement of Probe A, a biotinylated probe binding to the TIPARP active site, was measured using a time-resolved fluorescence energy transfer (TR-...
Ligand InfoPC cidPC sid
In DepthDetails US Patent
TargetProtein mono-ADP-ribosyltransferase TIPARP(Human)
Ribon Therapeutics
US Patent
LigandPNGBDBM476803(US10870641, Example 79B | US10870641, Example 79C ...)
Affinity DataIC50: <100nM. Assay description: Displacement of Probe A, a biotinylated probe binding to the TIPARP active site, was measured using a time-resolved fluorescence energy transfer (TR-...
Ligand InfoPC cidPC sid
In DepthDetails US Patent
TargetProtein mono-ADP-ribosyltransferase TIPARP(Human)
Ribon Therapeutics
US Patent
LigandPNGBDBM476803(US10870641, Example 79B | US10870641, Example 79C ...)
Affinity DataIC50: <100nM. Assay description: Displacement of Probe A, a biotinylated probe binding to the TIPARP active site, was measured using a time-resolved fluorescence energy transfer (TR-...
Ligand InfoPC cidPC sid
In DepthDetails US Patent
TargetProtein mono-ADP-ribosyltransferase TIPARP(Human)
Ribon Therapeutics
US Patent
LigandPNGBDBM476803(US10870641, Example 79B | US10870641, Example 79C ...)
Affinity DataIC50: <100nM. Assay description: Displacement of Probe A, a biotinylated probe binding to the TIPARP active site, was measured using a time-resolved fluorescence energy transfer (TR-...
Ligand InfoPC cidPC sid
In DepthDetails US Patent