BDBM47681 (3-fluorophenyl)-(1H-pyrazolo[3,4-d]pyrimidin-4-yl)amine::MLS001033418::N-(3-fluorophenyl)-1H-pyrazolo[3,4-d]pyrimidin-4-amine::SMR000363858::cid_2421499
SMILES Fc1cccc(Nc2ncnc3n[nH]cc23)c1
InChI Key InChIKey=MOPUQFYNNVMCTC-UHFFFAOYSA-N
Data  2 EC50
  Tab Delimited (TSV)   2D SDfile   Computed 3D by Vconf -m prep SDfile
Find this compound or compounds like it in BindingDB:
Activity Spreadsheet -- Enzyme Inhibition Constant Data from BindingDB
Found 2 hits for monomerid = 47681
TargetGlycogen synthase kinase-3 beta(Homo sapiens (Human))
Broad Institute
Curated by PubChem BioAssay
LigandPNGBDBM47681((3-fluorophenyl)-(1H-pyrazolo[3,4-d]pyrimidin-4-yl...)
Affinity DataEC50:  3.24E+4nM. Assay description: Keywords: GSK3beta, dose response, kinase, inhibition, HTS Assay Overview: The glycogen synthase kinase-3 beta (GSK-3b) is a known master regulator f...
In DepthDetails PCBioAssay
TargetGlutathione S-transferase Mu 1(Homo sapiens (Human))
Nmmlsc
Curated by PubChem BioAssay
LigandPNGBDBM47681((3-fluorophenyl)-(1H-pyrazolo[3,4-d]pyrimidin-4-yl...)
Affinity DataEC50:  4.51E+4nM. Assay description: University of New Mexico Assay Overview: Assay Support: NIH I RO3 MH081231-01 HTS to identify specific small molecule inhibitors of Ras and Ras-re...
In DepthDetails PCBioAssay