BDBM476853 US10870660, Compound III-697::US11345716, Compound III-697
SMILES CN1Cc2c(cccc2C(=O)N[C@H]2CC[C@H](CCN3CCc4sc(CCC(F)(F)F)nc4C3)CC2)C1=O
InChI Key InChIKey=KYGUWADEZNRGLX-IYARVYRRSA-N
Data  4 KI
  Tab Delimited (TSV)   2D SDfile   Computed 3D by Vconf -m prep SDfile
Find this compound or compounds like it in BindingDB:
Activity Spreadsheet -- Enzyme Inhibition Constant Data from BindingDB
Found 4 hits for monomerid = 476853
TargetD(3) dopamine receptor(Homo sapiens (Human))
Shionogi
US Patent
LigandPNGBDBM476853(US10870660, Compound III-697 | US11345716, Compoun...)
Affinity DataKi:  0.230nM. Assay description: 225 nL of the solutions of the non-specific ligand or the compounds of the present invention at each concentration (in case of vehicle, final concent...
Ligand InfoPC cidPC sid
In DepthDetails US Patent
TargetD(3) dopamine receptor(Homo sapiens (Human))
Shionogi
US Patent
LigandPNGBDBM476853(US10870660, Compound III-697 | US11345716, Compoun...)
Affinity DataKi:  0.230nM. Assay description: 225 nL of the solutions of the non-specific ligand or the compounds of the present invention at each concentration (in case of vehicle, final concent...
Ligand InfoPC cidPC sid
TargetD(2) dopamine receptor(Homo sapiens (Human))
Shionogi
US Patent
LigandPNGBDBM476853(US10870660, Compound III-697 | US11345716, Compoun...)
Affinity DataKi:  220nM. Assay description: 225 nL of the solutions of the non-specific ligand or the compounds of the present invention at each concentration (in case of vehicle, final concent...
Ligand InfoPC cidPC sid
TargetD(2) dopamine receptor(Homo sapiens (Human))
Shionogi
US Patent
LigandPNGBDBM476853(US10870660, Compound III-697 | US11345716, Compoun...)
Affinity DataKi:  220nM. Assay description: 225 nL of the solutions of the non-specific ligand or the compounds of the present invention at each concentration (in case of vehicle, final concent...
Ligand InfoPC cidPC sid
In DepthDetails US Patent