BDBM476859 US10870660, Compound II-005::US11345716, Compound II-005
SMILES Cc1ncc(CC(=O)N[C@H]2CC[C@H](CCN3CCc4ccc(OCC(F)F)nc4CC3)CC2)s1
InChI Key InChIKey=XGFFXWPMGJJBFH-KESTWPANSA-N
Data  4 KI
  Tab Delimited (TSV)   2D SDfile   Computed 3D by Vconf -m prep SDfile
Find this compound or compounds like it in BindingDB:
Activity Spreadsheet -- Enzyme Inhibition Constant Data from BindingDB
Found 4 hits for monomerid = 476859
TargetD(3) dopamine receptor(Homo sapiens (Human))
Shionogi
US Patent
LigandPNGBDBM476859(US10870660, Compound II-005 | US11345716, Compound...)
Affinity DataKi:  0.0850nM. Assay description: 225 nL of the solutions of the non-specific ligand or the compounds of the present invention at each concentration (in case of vehicle, final concent...
Ligand InfoPC cidPC sid
In DepthDetails US Patent
TargetD(3) dopamine receptor(Homo sapiens (Human))
Shionogi
US Patent
LigandPNGBDBM476859(US10870660, Compound II-005 | US11345716, Compound...)
Affinity DataKi:  0.0850nM. Assay description: 225 nL of the solutions of the non-specific ligand or the compounds of the present invention at each concentration (in case of vehicle, final concent...
Ligand InfoPC cidPC sid
TargetD(2) dopamine receptor(Homo sapiens (Human))
Shionogi
US Patent
LigandPNGBDBM476859(US10870660, Compound II-005 | US11345716, Compound...)
Affinity DataKi:  430nM. Assay description: 225 nL of the solutions of the non-specific ligand or the compounds of the present invention at each concentration (in case of vehicle, final concent...
Ligand InfoPC cidPC sid
TargetD(2) dopamine receptor(Homo sapiens (Human))
Shionogi
US Patent
LigandPNGBDBM476859(US10870660, Compound II-005 | US11345716, Compound...)
Affinity DataKi:  430nM. Assay description: 225 nL of the solutions of the non-specific ligand or the compounds of the present invention at each concentration (in case of vehicle, final concent...
Ligand InfoPC cidPC sid
In DepthDetails US Patent