BDBM477029 US10882844, Example 2007
SMILES CN1CCN(CC1)c1nc2cc(ccc2o1)-c1cccc(COc2cc(OCc3cncc(c3)C#N)c(CN3CCCC[C@H]3C(O)=O)cc2Cl)c1C
InChI Key InChIKey=CJMCRTHWPOQROF-DHUJRADRSA-N
Data  1 IC50
  Tab Delimited (TSV)   2D SDfile   Computed 3D by Vconf -m prep SDfile
Find this compound or compounds like it in BindingDB:
Activity Spreadsheet -- Enzyme Inhibition Constant Data from BindingDB
Found 1 hit for monomerid = 477029
TargetProgrammed cell death 1 ligand/protein 1(Homo sapiens)
Bristol-Myers Squibb
US Patent
LigandPNGBDBM477029(US10882844, Example 2007)
Affinity DataIC50:  3nM. Assay description: The interaction of PD-1 and PD-L1 can be assessed using soluble, purified preparations of the extracellular domains of the two proteins. The PD-1 and...
Ligand InfoPC cidPC sid
In DepthDetails US Patent