BDBM477199 US10889546, Example 9
SMILES CC(NC(=O)c1ncc(cc1O)C#Cc1ccc(cc1)C1CC1)C(O)=O
InChI Key InChIKey=UTMSBFXWCWGMKU-UHFFFAOYSA-N
Data  2 IC50
  Tab Delimited (TSV)   2D SDfile   Computed 3D by Vconf -m prep SDfile
Find this compound or compounds like it in BindingDB:
Activity Spreadsheet -- Enzyme Inhibition Constant Data from BindingDB
Found 2 hits for monomerid = 477199
TargetProlyl hydroxylase EGLN3(Homo sapiens (Human))
Jiangsu Hengrui Medicine
US Patent
LigandPNGBDBM477199(US10889546, Example 9)
Affinity DataIC50:  675nM. Assay description: The EGLN-1 (or EGLN-3) enzyme activity is determined using mass spectrometry (matrix-assisted laser desorption ionization, time-of-flight MS, MALD...
Ligand InfoPC cidPC sid
In DepthDetails US Patent
TargetEgl nine homolog 1(Homo sapiens (Human))
Jiangsu Hengrui Medicine
US Patent
LigandPNGBDBM477199(US10889546, Example 9)
Affinity DataIC50:  1.05E+3nM. Assay description: The EGLN-1 (or EGLN-3) enzyme activity is determined using mass spectrometry (matrix-assisted laser desorption ionization, time-of-flight MS, MALD...
Ligand InfoPC cidPC sid
In DepthDetails US Patent