BDBM477203 US10889546, Example 12
SMILES CCc1ccc(cc1)C#Cc1cnc(C(=O)CCC(O)=O)c(O)c1
InChI Key InChIKey=ZSWRPHGMMPBLMV-UHFFFAOYSA-N
Data  1 IC50
  Tab Delimited (TSV)   2D SDfile   Computed 3D by Vconf -m prep SDfile
Find this compound or compounds like it in BindingDB:
Activity Spreadsheet -- Enzyme Inhibition Constant Data from BindingDB
Found 1 hit for monomerid = 477203
TargetEgl nine homolog 1(Homo sapiens (Human))
Jiangsu Hengrui Medicine
US Patent
LigandPNGBDBM477203(US10889546, Example 12)
Affinity DataIC50:  2.78E+3nM. Assay description: The EGLN-1 (or EGLN-3) enzyme activity is determined using mass spectrometry (matrix-assisted laser desorption ionization, time-of-flight MS, MALD...
Ligand InfoPC cidPC sid
In DepthDetails US Patent