BDBM477206 US10889546, Example 15
SMILES OC(=O)CNC(=O)c1ncc(cc1O)C#Cc1ccc(F)cc1
InChI Key InChIKey=NPFGOHWVQFQLGJ-UHFFFAOYSA-N
Data  1 IC50
  Tab Delimited (TSV)   2D SDfile   Computed 3D by Vconf -m prep SDfile
Find this compound or compounds like it in BindingDB:
Activity Spreadsheet -- Enzyme Inhibition Constant Data from BindingDB
Found 1 hit for monomerid = 477206
TargetEgl nine homolog 1(Homo sapiens (Human))
Jiangsu Hengrui Medicine
US Patent
LigandPNGBDBM477206(US10889546, Example 15)
Affinity DataIC50:  567nM. Assay description: The EGLN-1 (or EGLN-3) enzyme activity is determined using mass spectrometry (matrix-assisted laser desorption ionization, time-of-flight MS, MALD...
Ligand InfoPC cidPC sid
In DepthDetails US Patent