BDBM477261 US10889546, Example 69
SMILES CCOc1cc(ccc1C)N(CC#Cc1cnc(C(=O)NCC(O)=O)c(O)c1)C(C)(C)C
InChI Key InChIKey=RIVVOIOKKGAMQH-UHFFFAOYSA-N
Data  1 IC50
  Tab Delimited (TSV)   2D SDfile   Computed 3D by Vconf -m prep SDfile
Find this compound or compounds like it in BindingDB:
Activity Spreadsheet -- Enzyme Inhibition Constant Data from BindingDB
Found 1 hit for monomerid = 477261
TargetEgl nine homolog 1(Homo sapiens (Human))
Jiangsu Hengrui Medicine
US Patent
LigandPNGBDBM477261(US10889546, Example 69)
Affinity DataIC50:  1.41E+3nM. Assay description: The EGLN-1 (or EGLN-3) enzyme activity is determined using mass spectrometry (matrix-assisted laser desorption ionization, time-of-flight MS, MALD...
Ligand InfoPC cidPC sid
In DepthDetails US Patent