BDBM477406 US10889555, Example 186::US11634395, Example 186
SMILES C[C@@H]([C@H](NS(=O)(=O)c1ccc(F)c(c1F)C(C)(C)O)c1n[nH]c(=O)o1)c1c(F)ccc(C)c1C
InChI Key
Data  2 IC50
  Tab Delimited (TSV)   2D SDfile   Computed 3D by Vconf -m prep SDfile
Find this compound or compounds like it in BindingDB:
Activity Spreadsheet -- Enzyme Inhibition Constant Data from BindingDB
Found 2 hits for monomerid = 477406
TargetRibonucleoside-diphosphate reductase large subunit/subunit M2(Homo sapiens (Human))
Taiho Pharmaceutial
US Patent
LigandPNGBDBM477406(US10889555, Example 186 | US11634395, Example 186)
Affinity DataIC50:  90nM. Assay description: The inhibitory activity against the ribonucleotide reduction reaction (hereinafter referred to as RNR reaction) of the test compound was determined b...
Ligand InfoPC cidPC sid
In DepthDetails US Patent
TargetMuscarinic acetylcholine receptor M1/M2(Homo sapiens (Human))
Taiho Pharmaceutical
US Patent
LigandPNGBDBM477406(US10889555, Example 186 | US11634395, Example 186)
Affinity DataIC50:  90nM. Assay description: First, test compounds were serially diluted with DMSO. Next, human M1 protein and human M2 protein were added to an aqueous albumin solution derived ...
Ligand InfoPC cidPC sid
In DepthDetails US Patent