BDBM477578 Methyl 6-({[1-(2-fluorophenyl)-4,5,6,7-tetrahydro-1H-indazol-4-yl]amino}carbonyl)nicotinate::US10889564, Example 7
SMILES COC(=O)c1ccc(nc1)C(=O)NC1CCCc2c1cnn2-c1ccccc1F
InChI Key InChIKey=OEMVYJHARGYDHW-UHFFFAOYSA-N
Data  2 IC50
  Tab Delimited (TSV)   2D SDfile   Computed 3D by Vconf -m prep SDfile
Find this compound or compounds like it in BindingDB:
Activity Spreadsheet -- Enzyme Inhibition Constant Data from BindingDB
Found 2 hits for monomerid = 477578
TargetDihydroorotate dehydrogenase (quinone), mitochondrial(Homo sapiens (Human))
Karolinska Institutet
Curated by ChEMBL
LigandPNGBDBM477578(Methyl 6-({[1-(2-fluorophenyl)-4,5,6,7-tetrahydro-...)
Affinity DataIC50: >1.00E+4nM. Assay description: Inhibition of recombinant human DHODH using dihydroorotic acid as substrate measured for 68 mins by DCIP based colorimetric assay
In DepthDetails ArticlePubMed
TargetDihydroorotate dehydrogenase (quinone), mitochondrial(Homo sapiens (Human))
Karolinska Institutet
Curated by ChEMBL
LigandPNGBDBM477578(Methyl 6-({[1-(2-fluorophenyl)-4,5,6,7-tetrahydro-...)
Affinity DataIC50: >1.00E+4nM. Assay description: Assay A: DHODH enzyme assays were performed with 6 nM recombinant human DHODH (purified essentially as described by Walse et. al., Biochemistry, 47, ...
In DepthDetails US Patent