BDBM477596 3-methyl-N-[(4R)-1-(2-methylphenyl)-4,5,6,7-tetrahydro-1H-indazol-4-yl]pyridine-2-carboxamide::US10889564, Example 26
SMILES Cc1ccccc1-n1ncc2[C@@H](CCCc12)NC(=O)c1ncccc1C
InChI Key InChIKey=CGCNEXKFUPQMEJ-QGZVFWFLSA-N
Data  1 IC50
  Tab Delimited (TSV)   2D SDfile   Computed 3D by Vconf -m prep SDfile
Find this compound or compounds like it in BindingDB:
Activity Spreadsheet -- Enzyme Inhibition Constant Data from BindingDB
Found 1 hit for monomerid = 477596
TargetDihydroorotate dehydrogenase (quinone), mitochondrial(Homo sapiens (Human))
Genase Therapeutics
US Patent
LigandPNGBDBM477596(3-methyl-N-[(4R)-1-(2-methylphenyl)-4,5,6,7-tetrah...)
Affinity DataIC50:  96nM. Assay description: Assay B: Example compounds as described herein were dispensed with an acoustic liquid handler, Echo 550 (Labcyte) to a maximum volume of 50 nl per we...
Ligand InfoPC cidPC sid
In DepthDetails US Patent