BDBM477644 1-(1-(4-(Benzo[d][1,3]dioxolan-5-yl)-5-(methoxymethyl)-4H-1,2,4-triazol-3-yl)azetidin-3-yl)-6-fluoro-1,2,3,4-tetrahydroquinoline 28::US10889569, Example 28
SMILES COCc1nnc(N2CC(C2)N2CCCc3cc(F)ccc23)n1-c1ccc2OCOc2c1
InChI Key InChIKey=XINNTZHVAXMREV-UHFFFAOYSA-N
Data  1 IC50
  Tab Delimited (TSV)   2D SDfile   Computed 3D by Vconf -m prep SDfile
Find this compound or compounds like it in BindingDB:
Activity Spreadsheet -- Enzyme Inhibition Constant Data from BindingDB
Found 1 hit for monomerid = 477644
TargetVasopressin V1a receptor(Homo sapiens (Human))
Jiangsu Hengrui Medicine
US Patent
LigandPNGBDBM477644(1-(1-(4-(Benzo[d][1,3]dioxolan-5-yl)-5-(methoxymet...)
Affinity DataIC50:  2.40E+3nM. Assay description: V1aR: The inhibition effect of the compounds of the present invention on the activity of human V1 aR protein expressed in HEK293/human V1aR stably tr...
Ligand InfoPC cidPC sid
In DepthDetails US Patent