BDBM477651 Methyl ((5-(3-(6-fluoro-3,4-dihydroquinolin-1(2H)-yl)azetidin-1-yl)-4-(6-methoxypyridin-3-yl)-4H-1,2,4-triazol-3-yl)methyl)carbamate 36::US10889569, Example 36
SMILES COC(=O)NCc1nnc(N2CC(C2)N2CCCc3cc(F)ccc23)n1-c1ccc(OC)nc1
InChI Key InChIKey=CMNGOWQEUVNYCB-UHFFFAOYSA-N
Data  1 IC50
  Tab Delimited (TSV)   2D SDfile   Computed 3D by Vconf -m prep SDfile
Find this compound or compounds like it in BindingDB:
Activity Spreadsheet -- Enzyme Inhibition Constant Data from BindingDB
Found 1 hit for monomerid = 477651
TargetVasopressin V1a receptor(Homo sapiens (Human))
Jiangsu Hengrui Medicine
US Patent
LigandPNGBDBM477651(Methyl ((5-(3-(6-fluoro-3,4-dihydroquinolin-1(2H)-...)
Affinity DataIC50:  2.10E+3nM. Assay description: V1aR: The inhibition effect of the compounds of the present invention on the activity of human V1 aR protein expressed in HEK293/human V1aR stably tr...
Ligand InfoPC cidPC sid
In DepthDetails US Patent