BDBM478029 US10889592, Compound I-10
SMILES Cc1cnc2c(N)c(sc2n1)C(=O)NCCc1ccc(cc1F)N1C2CCC1CNC2
InChI Key InChIKey=YOQBOAXBPCUTLW-UHFFFAOYSA-N
Data  2 IC50
  Tab Delimited (TSV)   2D SDfile   Computed 3D by Vconf -m prep SDfile
Find this compound or compounds like it in BindingDB:
Activity Spreadsheet -- Enzyme Inhibition Constant Data from BindingDB
Found 2 hits for monomerid = 478029
TargetUbiquitin carboxyl-terminal hydrolase 25(Homo sapiens)
Valo Early Discovery
US Patent
LigandPNGBDBM478029(US10889592, Compound I-10)
Affinity DataIC50:  1.10E+3nM. Assay description: USP25: The assay was performed in a final volume of 9 μL in assay buffer containing 20 mM Tris-HCl (pH 8.0, (1M Tris-HCl, pH 8.0 solution; Corni...
Ligand InfoPC cidPC sid
In DepthDetails US Patent
TargetUbiquitin carboxyl-terminal hydrolase 28(Homo sapiens)
Valo Early Discovery
US Patent
LigandPNGBDBM478029(US10889592, Compound I-10)
Affinity DataIC50: <200nM. Assay description: USP28: Each assay was performed in a final volume of 20 μL in assay buffer containing 20 mM Tris-HCl (pH 8.0, (1M Tris-HCl, pH 8.0 solution; Cor...
Ligand InfoPC cidPC sid
In DepthDetails US Patent