BDBM478088 1-((3-(8-cyano-2-methylindolizin-5-yl)pyridin-4-yl)thio)cyclobutane-1-carboxylic acid ::US10894038, Example 5
SMILES Cc1cc2c(ccc(-c3cnccc3SC3(CCC3)C(O)=O)n2c1)C#N
InChI Key InChIKey=YIKIPHMLVZEWIK-UHFFFAOYSA-N
Data  1 IC50
  Tab Delimited (TSV)   2D SDfile   Computed 3D by Vconf -m prep SDfile
Find this compound or compounds like it in BindingDB:
Activity Spreadsheet -- Enzyme Inhibition Constant Data from BindingDB
Found 1 hit for monomerid = 478088
TargetSolute carrier family 22 member 12(Homo sapiens (Human))
Shanghai Fochon Pharmaceutical
US Patent
LigandPNGBDBM478088(1-((3-(8-cyano-2-methylindolizin-5-yl)pyridin-4-yl...)
Affinity DataIC50:  110nM. Assay description: Cells were seeded onto 24-well plates at the density of 2.0×105 cells per well. The cells were incubated at 37° C., 5% CO2 overnight. After approxima...
Ligand InfoPC cidPC sid
In DepthDetails US Patent