BDBM478112 (R)-((6-(2-(Hydroxymethyl)-1H- benzo[d]imidazol-1-yl)-4-(3- methylmorpholino)pyridin-2- yl)imino)dimethyl-lambda6-sulfanone::US10894052, Example 7
SMILES C[C@@H]1COCCN1c1cc(N=S(C)(C)=O)nc(c1)-n1c(CO)nc2ccccc12
InChI Key InChIKey=JHDULBPLAILCDR-CQSZACIVSA-N
Data  1 IC50
  Tab Delimited (TSV)   2D SDfile   Computed 3D by Vconf -m prep SDfile
Find this compound or compounds like it in BindingDB:
Activity Spreadsheet -- Enzyme Inhibition Constant Data from BindingDB
Found 1 hit for monomerid = 478112
TargetATR-interacting protein/Serine/threonine-protein kinase ATR(Homo sapiens (Human))
Board Of Regents, The University Of Texas System
US Patent
LigandPNGBDBM478112((R)-((6-(2-(Hydroxymethyl)-1H- benzo[d]imidazol-1-...)
Affinity DataIC50:  16nM. Assay description: Human full-length FLAG-TEV-ATR and His6-ATRIP were co-expressed in HEK293 cells. The cell pellet (20 g) was harvested and lysed in 100 mL of lysis bu...
Ligand InfoPC cidPC sid
In DepthDetails US Patent