BDBM478133 (R)-((6-(6-chloro-1H-pyrrolo[2,3- b]pyridin-4-yl)-4-(3- methylmorpholino)pyridin-2- yl)imino)dimethyl-lambda6-sulfanone::US10894052, Example 27
SMILES C[C@@H]1COCCN1c1cc(N=S(C)(C)=O)nc(c1)-c1cc(Cl)nc2[nH]ccc12
InChI Key
Data  1 IC50
  Tab Delimited (TSV)   2D SDfile   Computed 3D by Vconf -m prep SDfile
Find this compound or compounds like it in BindingDB:
Activity Spreadsheet -- Enzyme Inhibition Constant Data from BindingDB
Found 1 hit for monomerid = 478133
TargetATR-interacting protein/Serine/threonine-protein kinase ATR(Homo sapiens (Human))
Board Of Regents, The University Of Texas System
US Patent
LigandPNGBDBM478133((R)-((6-(6-chloro-1H-pyrrolo[2,3- b]pyridin-4-yl)-...)
Affinity DataIC50:  30nM. Assay description: Human full-length FLAG-TEV-ATR and His6-ATRIP were co-expressed in HEK293 cells. The cell pellet (20 g) was harvested and lysed in 100 mL of lysis bu...
Ligand InfoPC cidPC sid
In DepthDetails US Patent