BDBM478137 US10894048, Ex Comp 55
SMILES COc1cc(OC)cc(c1)C#Cc1nn(C2CN(C2)C(=O)\C=C\CN2CCC2)c2ncnc(N)c12
InChI Key InChIKey=RMOPFBRCISQCEG-HWKANZROSA-N
Data  1 IC50
  Tab Delimited (TSV)   2D SDfile   Computed 3D by Vconf -m prep SDfile
Find this compound or compounds like it in BindingDB:
Activity Spreadsheet -- Enzyme Inhibition Constant Data from BindingDB
Found 1 hit for monomerid = 478137
TargetFibroblast growth factor receptor 2(Homo sapiens (Human))
Taiho Pharmaceutical
US Patent
LigandPNGBDBM478137(US10894048, Ex Comp 55)
Affinity DataIC50:  2.5nM. Assay description: When setting conditions for the measurement of the inhibitory effect of the compounds on FGFR2 kinase activity, FL-Peptide 22 (Caliper Life Sciences,...
Ligand InfoPC cidPC sid
In DepthDetails US Patent