BDBM478189 US10894782, No 42
SMILES CC(C)N1CCN(CCNC(=O)OC(C)C#Cc2ccc(OCc3nnc(SC4CCCC4)n3-c3cccnc3)cc2C)CC1
InChI Key InChIKey=SQOAZMQQQTVONL-UHFFFAOYSA-N
Data  1 IC50
  Tab Delimited (TSV)   2D SDfile   Computed 3D by Vconf -m prep SDfile
Find this compound or compounds like it in BindingDB:
Activity Spreadsheet -- Enzyme Inhibition Constant Data from BindingDB
Found 1 hit for monomerid = 478189
TargetTransitional endoplasmic reticulum ATPase(Homo sapiens (Human))
University Of Pittsburgh
US Patent
LigandPNGBDBM478189(US10894782, No 42)
Affinity DataIC50:  130nM. Assay description: Biomol Green (Enzo) is a bioluminescent, homogeneous assay that measures ADP formed from a biochemical reaction. Because of its high sensitivity, the...
Ligand InfoPC cidPC sid
In DepthDetails US Patent