BDBM478196 US10894782, No 49
SMILES Cc1cc(OCc2nnc(CC3CCCC3)n2-c2cccnc2)ccc1C#CCNC(=O)OC(C)(C)C
InChI Key InChIKey=KYTVFPLIOPIOIZ-UHFFFAOYSA-N
Data  1 IC50
  Tab Delimited (TSV)   2D SDfile   Computed 3D by Vconf -m prep SDfile
Find this compound or compounds like it in BindingDB:
Activity Spreadsheet -- Enzyme Inhibition Constant Data from BindingDB
Found 1 hit for monomerid = 478196
TargetTransitional endoplasmic reticulum ATPase(Homo sapiens (Human))
University Of Pittsburgh
US Patent
LigandPNGBDBM478196(US10894782, No 49)
Affinity DataIC50:  260nM. Assay description: Biomol Green (Enzo) is a bioluminescent, homogeneous assay that measures ADP formed from a biochemical reaction. Because of its high sensitivity, the...
Ligand InfoPC cidPC sid
In DepthDetails US Patent