BDBM478200 US10894782, No 53
SMILES Cc1cc(OCc2nnc(SC3CCCC=C3)n2-c2cccnc2)ccc1C#CC1(CCCCC1)NC(=O)OC(C)(C)C
InChI Key InChIKey=WYSBPMRGVQUCFT-UHFFFAOYSA-N
Data  1 IC50
  Tab Delimited (TSV)   2D SDfile   Computed 3D by Vconf -m prep SDfile
Find this compound or compounds like it in BindingDB:
Activity Spreadsheet -- Enzyme Inhibition Constant Data from BindingDB
Found 1 hit for monomerid = 478200
TargetTransitional endoplasmic reticulum ATPase(Homo sapiens (Human))
University Of Pittsburgh
US Patent
LigandPNGBDBM478200(US10894782, No 53)
Affinity DataIC50:  1.10E+3nM. Assay description: Biomol Green (Enzo) is a bioluminescent, homogeneous assay that measures ADP formed from a biochemical reaction. Because of its high sensitivity, the...
Ligand InfoPC cidPC sid
In DepthDetails US Patent