BDBM478241 US10894782, No 112::US10894782, No 94
SMILES CCC(=O)NCC#Cc1ccc(OCc2nnc(SC3CCCC=C3)n2-c2cccnc2)cc1C
InChI Key InChIKey=ZKOMNATYRKNEEF-UHFFFAOYSA-N
Data  2 IC50
  Tab Delimited (TSV)   2D SDfile   Computed 3D by Vconf -m prep SDfile
Find this compound or compounds like it in BindingDB:
Activity Spreadsheet -- Enzyme Inhibition Constant Data from BindingDB
Found 2 hits for monomerid = 478241
TargetTransitional endoplasmic reticulum ATPase(Homo sapiens (Human))
University Of Pittsburgh
US Patent
LigandPNGBDBM478241(US10894782, No 112 | US10894782, No 94)
Affinity DataIC50:  25nM. Assay description: Biomol Green (Enzo) is a bioluminescent, homogeneous assay that measures ADP formed from a biochemical reaction. Because of its high sensitivity, the...
Ligand InfoPC cidPC sid
In DepthDetails US Patent
TargetTransitional endoplasmic reticulum ATPase(Homo sapiens (Human))
University Of Pittsburgh
US Patent
LigandPNGBDBM478241(US10894782, No 112 | US10894782, No 94)
Affinity DataIC50:  30nM. Assay description: Biomol Green (Enzo) is a bioluminescent, homogeneous assay that measures ADP formed from a biochemical reaction. Because of its high sensitivity, the...
Ligand InfoPC cidPC sid
In DepthDetails US Patent