BDBM478278 US10894782, No 133
SMILES Cc1cc(OCc2nnc(SC3CCCC3)n2-c2cccnc2)ccc1C#CCOC(=O)OCC#Cc1ccc(OCc2nnc(SC3CCCC3)n2-c2cccnc2)cc1C
InChI Key InChIKey=YFYQUASKMDYPAD-UHFFFAOYSA-N
Data  1 IC50
  Tab Delimited (TSV)   2D SDfile   Computed 3D by Vconf -m prep SDfile
Find this compound or compounds like it in BindingDB:
Activity Spreadsheet -- Enzyme Inhibition Constant Data from BindingDB
Found 1 hit for monomerid = 478278
TargetTransitional endoplasmic reticulum ATPase(Homo sapiens (Human))
University Of Pittsburgh
US Patent
LigandPNGBDBM478278(US10894782, No 133)
Affinity DataIC50:  910nM. Assay description: Biomol Green (Enzo) is a bioluminescent, homogeneous assay that measures ADP formed from a biochemical reaction. Because of its high sensitivity, the...
Ligand InfoPC cidPC sid
In DepthDetails US Patent