BDBM47832 1-N-(1-benzothiophen-3-yl)piperidine-1,4-dicarboxamide::MLS000858903::N-(benzothiophen-3-yl)piperidine-1,4-dicarboxamide::N1-(1-benzothiophen-3-yl)piperidine-1,4-dicarboxamide::N~1~-(1-benzothiophen-3-yl)tetrahydro-1,4(2H)-pyridinedicarboxamide::SMR000458982::cid_2816288
SMILES NC(=O)C1CCN(CC1)C(=O)Nc1csc2ccccc12
InChI Key InChIKey=DIUJUKDDAKDFSF-UHFFFAOYSA-N
Data  5 EC50
  Tab Delimited (TSV)   2D SDfile   Computed 3D by Vconf -m prep SDfile
Find this compound or compounds like it in BindingDB:
Activity Spreadsheet -- Enzyme Inhibition Constant Data from BindingDB
Found 5 hits for monomerid = 47832
TargetRegulator of G-protein signaling 8(Homo sapiens (Human))
Nmmlsc
Curated by PubChem BioAssay
LigandPNGBDBM47832(1-N-(1-benzothiophen-3-yl)piperidine-1,4-dicarboxa...)
Affinity DataEC50: >3.00E+4nM. Assay description: University of New Mexico Assay Overview: Assay Support: NIH R21NS057014 HTS to identify small molecule regulators of RGS family protein interaction...
In DepthDetails PCBioAssay
TargetRegulator of G-protein signaling 7(Homo sapiens (Human))
Nmmlsc
Curated by PubChem BioAssay
LigandPNGBDBM47832(1-N-(1-benzothiophen-3-yl)piperidine-1,4-dicarboxa...)
Affinity DataEC50: >3.00E+4nM. Assay description: University of New Mexico Assay Overview: Assay Support: NIH R21NS057014 HTS to identify small molecule regulators of RGS family protein interaction...
In DepthDetails PCBioAssay
TargetRegulator of G-protein signaling 4(Homo sapiens (Human))
Nmmlsc
Curated by PubChem BioAssay
LigandPNGBDBM47832(1-N-(1-benzothiophen-3-yl)piperidine-1,4-dicarboxa...)
Affinity DataEC50:  3.00E+4nM. Assay description: University of New Mexico Assay Overview: Assay Support: NIH R21NS057014 HTS to identify small molecule regulators of RGS family protein interaction...
In DepthDetails PCBioAssay
TargetRegulator of G-protein signaling 16(Homo sapiens (Human))
Nmmlsc
Curated by PubChem BioAssay
LigandPNGBDBM47832(1-N-(1-benzothiophen-3-yl)piperidine-1,4-dicarboxa...)
Affinity DataEC50: >3.00E+4nM. Assay description: University of New Mexico Assay Overview: Assay Support: NIH R21NS057014 HTS to identify small molecule regulators of RGS family protein interaction...
In DepthDetails PCBioAssay
TargetRegulator of G-protein signaling 19(Homo sapiens (Human))
Nmmlsc
Curated by PubChem BioAssay
LigandPNGBDBM47832(1-N-(1-benzothiophen-3-yl)piperidine-1,4-dicarboxa...)
Affinity DataEC50: >3.00E+4nM. Assay description: University of New Mexico Assay Overview: Assay Support: NIH R21NS057014 HTS to identify small molecule regulators of RGS family protein interaction...
In DepthDetails PCBioAssay