BDBM47846 3-pyridinyl 4-methoxybenzoate::4-methoxybenzoic acid 3-pyridinyl ester::4-methoxybenzoic acid 3-pyridyl ester::MLS000534346::SMR000141778::cid_1120962::pyridin-3-yl 4-methoxybenzoate
SMILES COc1ccc(cc1)C(=O)Oc1cccnc1
InChI Key InChIKey=SAWNYFZZFROOIO-UHFFFAOYSA-N
Data  1 IC50
  Tab Delimited (TSV)   2D SDfile   Computed 3D by Vconf -m prep SDfile
Find this compound or compounds like it in BindingDB:
Activity Spreadsheet -- Enzyme Inhibition Constant Data from BindingDB
Found 1 hit for monomerid = 47846
Target3C-like protease(Avian infectious bronchitis virus)
The Scripps Research Institute Molecular Screening Center
Curated by PubChem BioAssay
LigandPNGBDBM47846(3-pyridinyl 4-methoxybenzoate | 4-methoxybenzoic a...)
Affinity DataIC50: >5.96E+4nM. Assay description: Source (MLPCN Center Name): The Scripps Research Institute Molecular Screening Center (SRIMSC) Center Affiliation: The Scripps Research Institute (TS...
In DepthDetails PCBioAssay