BDBM478728 3,3,3-trifluoro-1-(4-{(1R or 1S)-1-[2-({6-[6-(morpholin-4-yl)pyrimidin-4-yl]-1H-benzimidazol-2-yl}amino)pyridin-4-yl]ethyl}piperazin-1-yl)propan-1-one::US10894784, Example 118.03
SMILES CC(N1CCN(CC1)C(=O)CC(F)(F)F)c1ccnc(Nc2nc3ccc(cc3[nH]2)-c2cc(ncn2)N2CCOCC2)c1
InChI Key
Data  1 IC50
  Tab Delimited (TSV)   2D SDfile   Computed 3D by Vconf -m prep SDfile
Find this compound or compounds like it in BindingDB:
Activity Spreadsheet -- Enzyme Inhibition Constant Data from BindingDB
Found 1 hit for monomerid = 478728
TargetSerine/threonine-protein kinase TBK1(Homo sapiens (Human))
Bayer Pharma Aktiengesellschaft
US Patent
LigandPNGBDBM478728(3,3,3-trifluoro-1-(4-{(1R or 1S)-1-[2-({6-[6-(morp...)
Affinity DataIC50:  1.40nM. Assay description: Recombinant full-length N-terminally His-tagged human TBK1, expressed in insect cells and purified by Ni-NTA affinity chromatography, was purchased f...
Ligand InfoPC cidPC sid
In DepthDetails US Patent