BDBM478946 2-(6-(1-acryloylpyrrolidin-3-yl)pyridin-3-yl)-N-(5-cyclopropyl-1H-pyrazol-3- yl)propanamide::US10894786, Comp. No 48
SMILES CC(C(=O)Nc1cc([nH]n1)C1CC1)c1ccc(nc1)C1CCN(C1)C(=O)C=C
InChI Key
Data  2 IC50
  Tab Delimited (TSV)   2D SDfile   Computed 3D by Vconf -m prep SDfile
Find this compound or compounds like it in BindingDB:
Activity Spreadsheet -- Enzyme Inhibition Constant Data from BindingDB
Found 2 hits for monomerid = 478946
TargetCyclin-dependent kinase 13(Homo sapiens (Human))
Aurigene Discovery Technologies
US Patent
LigandPNGBDBM478946(2-(6-(1-acryloylpyrrolidin-3-yl)pyridin-3-yl)-N-(5...)
Affinity DataIC50:  6nM. Assay description: LanthaScreen Eu Kinase Binding Assays are based on the binding and displacement of Alexa Fluor 647-labeled, ATP-competitive kinase inhibitor scaffold...
Ligand InfoPC cidPC sid
In DepthDetails US Patent
TargetCyclin-dependent kinase 12(Homo sapiens)
Aurigene Discovery Technologies
US Patent
LigandPNGBDBM478946(2-(6-(1-acryloylpyrrolidin-3-yl)pyridin-3-yl)-N-(5...)
Affinity DataIC50:  55nM. Assay description: The inhibitory activity of the test compounds was assessed by the LANCE TR-FRET assay, which detects the ATP-dependent phosphorylation of an ULight-4...
Ligand InfoPC cidPC sid
In DepthDetails US Patent