BDBM478948 N-(5-cyclopropyl-1H-pyrazol-3-yl)-2-(1'-propioloyl-1',2',3',6'-tetrahydro-[2,4'- bipyridin]-5-yl)propanamide::US10894786, Comp. No 50
SMILES CC(C(=O)Nc1cc([nH]n1)C1CC1)c1ccc(nc1)C1=CCN(CC1)C(=O)C#C[Si](C)(C)C
InChI Key
Data  2 IC50
  Tab Delimited (TSV)   2D SDfile   Computed 3D by Vconf -m prep SDfile
Find this compound or compounds like it in BindingDB:
Activity Spreadsheet -- Enzyme Inhibition Constant Data from BindingDB
Found 2 hits for monomerid = 478948
TargetCyclin-dependent kinase 7(Homo sapiens (Human))
Aurigene Discovery Technologies
US Patent
LigandPNGBDBM478948(N-(5-cyclopropyl-1H-pyrazol-3-yl)-2-(1'-propioloyl...)
Affinity DataIC50:  12nM. Assay description: The inhibitory activity of the test compounds was assessed by the LANCE TR-FRET assay, which detects the ATP-dependent phosphorylation of an ULight-m...
Ligand InfoPC cidPC sid
In DepthDetails US Patent
TargetCyclin-dependent kinase 13(Homo sapiens (Human))
Aurigene Discovery Technologies
US Patent
LigandPNGBDBM478948(N-(5-cyclopropyl-1H-pyrazol-3-yl)-2-(1'-propioloyl...)
Affinity DataIC50:  7nM. Assay description: LanthaScreen Eu Kinase Binding Assays are based on the binding and displacement of Alexa Fluor 647-labeled, ATP-competitive kinase inhibitor scaffold...
Ligand InfoPC cidPC sid
In DepthDetails US Patent