BDBM478965 (R)-N-(2-chloro-4-(3-((5-chloro-4- methoxypyrimidin-2- yl)amino)pyrrolidine-1- carbonyl)phenyl)acrylamide::US10894788, Example 5::US10894788, Example 66::US11390618, Example 66
SMILES COc1nc(N[C@@H]2CCN(C2)C(=O)c2ccc(NC(=O)C=C)c(Cl)c2)ncc1Cl
InChI Key InChIKey=OXRIVTKSQCWTFW-GFCCVEGCSA-N
Data  4 IC50
  Tab Delimited (TSV)   2D SDfile   Computed 3D by Vconf -m prep SDfile
Find this compound or compounds like it in BindingDB:
Activity Spreadsheet -- Enzyme Inhibition Constant Data from BindingDB
Found 4 hits for monomerid = 478965
TargetCyclin-dependent kinase 12(Homo sapiens)
Kinnate Biopharma
US Patent
LigandPNGBDBM478965((R)-N-(2-chloro-4-(3-((5-chloro-4- methoxypyrimidi...)
Affinity DataIC50: <100nM. Assay description: For the assays, 5 μl solution from each well of the compound dilution plates/10% DMSO were transferred into the assay plates. The final volume o...
Ligand InfoPC cidPC sid
In DepthDetails US Patent
TargetCyclin-K/Cyclin-dependent kinase 12(Homo sapiens (Human))
Kinnate Biopharma
US Patent
LigandPNGBDBM478965((R)-N-(2-chloro-4-(3-((5-chloro-4- methoxypyrimidi...)
Affinity DataIC50: <100nM. Assay description: The IC50 profile of compounds was determined using one protein kinase in a customized, thiol free assay. IC50 values were measured by testing 10 conc...
Ligand InfoPC cidPC sid
In DepthDetails US Patent
TargetCyclin-K/Cyclin-dependent kinase 12(Homo sapiens (Human))
Kinnate Biopharma
US Patent
LigandPNGBDBM478965((R)-N-(2-chloro-4-(3-((5-chloro-4- methoxypyrimidi...)
Affinity DataIC50: <100nM. Assay description: The IC50 profile of compounds was determined using one protein kinase in a customized, thiol free assay. IC50 values were measured by testing 10 conc...
Ligand InfoPC cidPC sid
In DepthDetails US Patent
TargetCyclin-dependent kinase 12(Homo sapiens)
Kinnate Biopharma
US Patent
LigandPNGBDBM478965((R)-N-(2-chloro-4-(3-((5-chloro-4- methoxypyrimidi...)
Affinity DataIC50: <100nM. Assay description: For the assays, 5 μl solution from each well of the compound dilution plates/10% DMSO were transferred into the assay plates. The final volume o...
Ligand InfoPC cidPC sid
In DepthDetails US Patent