BDBM478976 (R)-N-(4-(3-((4-cyclopropoxy-5- methylpyrimidin-2- yl)amino)pyrrolidine-1- carbonyl)phenyl)propionamide::US10894788, Example 16::US11390618, Example 16
SMILES CCC(=O)Nc1ccc(cc1)C(=O)N1CC[C@H](C1)Nc1ncc(C)c(OC2CC2)n1
InChI Key InChIKey=QZDVUICNPVNLCM-QGZVFWFLSA-N
Data  2 IC50
  Tab Delimited (TSV)   2D SDfile   Computed 3D by Vconf -m prep SDfile
Find this compound or compounds like it in BindingDB:
Activity Spreadsheet -- Enzyme Inhibition Constant Data from BindingDB
Found 2 hits for monomerid = 478976
TargetCyclin-K/Cyclin-dependent kinase 12(Homo sapiens (Human))
Kinnate Biopharma
US Patent
LigandPNGBDBM478976((R)-N-(4-(3-((4-cyclopropoxy-5- methylpyrimidin-2-...)
Affinity DataIC50:  5.50E+3nM. Assay description: The IC50 profile of compounds was determined using one protein kinase in a customized, thiol free assay. IC50 values were measured by testing 10 conc...
Ligand InfoPC cidPC sid
In DepthDetails US Patent
TargetCyclin-dependent kinase 12(Homo sapiens)
Kinnate Biopharma
US Patent
LigandPNGBDBM478976((R)-N-(4-(3-((4-cyclopropoxy-5- methylpyrimidin-2-...)
Affinity DataIC50:  5.50E+3nM. Assay description: For the assays, 5 μl solution from each well of the compound dilution plates/10% DMSO were transferred into the assay plates. The final volume o...
Ligand InfoPC cidPC sid
In DepthDetails US Patent