BDBM478977 (R)-N-(4-(3-((5-bromopyrimidin-2- yl)amino)pyrrolidine-1- carbonyl)phenyl)propionamide::US10894788, Example 17::US11390618, Example 17
SMILES CCC(=O)Nc1ccc(cc1)C(=O)N1CC[C@H](C1)Nc1ncc(Br)cn1
InChI Key InChIKey=HAPMPJQMNDISFK-OAHLLOKOSA-N
Data  4 IC50
  Tab Delimited (TSV)   2D SDfile   Computed 3D by Vconf -m prep SDfile
Find this compound or compounds like it in BindingDB:
Activity Spreadsheet -- Enzyme Inhibition Constant Data from BindingDB
Found 4 hits for monomerid = 478977
TargetCyclin-dependent kinase 12(Homo sapiens)
Kinnate Biopharma
US Patent
LigandPNGBDBM478977((R)-N-(4-(3-((5-bromopyrimidin-2- yl)amino)pyrroli...)
Affinity DataIC50:  550nM. Assay description: The IC50 profile of compounds was determined using one protein kinase in a customized, thiol free assay. IC50 values were measured by testing 10 conc...
Ligand InfoPC cidPC sid
In DepthDetails US Patent
TargetCyclin-K/Cyclin-dependent kinase 12(Homo sapiens (Human))
Kinnate Biopharma
US Patent
LigandPNGBDBM478977((R)-N-(4-(3-((5-bromopyrimidin-2- yl)amino)pyrroli...)
Affinity DataIC50:  550nM. Assay description: The IC50 profile of compounds was determined using one protein kinase in a customized, thiol free assay. IC50 values were measured by testing 10 conc...
Ligand InfoPC cidPC sid
In DepthDetails US Patent
TargetCyclin-K/Cyclin-dependent kinase 12(Homo sapiens (Human))
Kinnate Biopharma
US Patent
LigandPNGBDBM478977((R)-N-(4-(3-((5-bromopyrimidin-2- yl)amino)pyrroli...)
Affinity DataIC50:  550nM. Assay description: The IC50 profile of test compounds was determined using three protein kinases. IC50 values were measured by testing 10 concentrations (1×10−04M...
Ligand InfoPC cidPC sid
In DepthDetails US Patent
TargetCyclin-dependent kinase 12(Homo sapiens)
Kinnate Biopharma
US Patent
LigandPNGBDBM478977((R)-N-(4-(3-((5-bromopyrimidin-2- yl)amino)pyrroli...)
Affinity DataIC50:  550nM. Assay description: For the assays, 5 μl solution from each well of the compound dilution plates/10% DMSO were transferred into the assay plates. The final volume o...
Ligand InfoPC cidPC sid
In DepthDetails US Patent