BDBM478989 (R)-N-(4-(3-((5-chloropyrimidin-2- yl)amino)pyrrolidine-1-carbonyl)-2- methylphenyl)acrylamide::US10894788, Example 29::US11390618, Example 29
SMILES Cc1cc(ccc1NC(=O)C=C)C(=O)N1CC[C@H](C1)Nc1ncc(Cl)cn1
InChI Key InChIKey=MATPVGHWQGMDHM-OAHLLOKOSA-N
Data  4 IC50
  Tab Delimited (TSV)   2D SDfile   Computed 3D by Vconf -m prep SDfile
Find this compound or compounds like it in BindingDB:
Activity Spreadsheet -- Enzyme Inhibition Constant Data from BindingDB
Found 4 hits for monomerid = 478989
TargetCyclin-dependent kinase 12(Homo sapiens)
Kinnate Biopharma
US Patent
LigandPNGBDBM478989((R)-N-(4-(3-((5-chloropyrimidin-2- yl)amino)pyrrol...)
Affinity DataIC50:  550nM. Assay description: The IC50 profile of compounds was determined using one protein kinase in a customized, thiol free assay. IC50 values were measured by testing 10 conc...
Ligand InfoPC cidPC sid
In DepthDetails US Patent
TargetCyclin-K/Cyclin-dependent kinase 12(Homo sapiens (Human))
Kinnate Biopharma
US Patent
LigandPNGBDBM478989((R)-N-(4-(3-((5-chloropyrimidin-2- yl)amino)pyrrol...)
Affinity DataIC50: <100nM. Assay description: The IC50 profile of compounds was determined using one protein kinase in a customized, thiol free assay. IC50 values were measured by testing 10 conc...
Ligand InfoPC cidPC sid
In DepthDetails US Patent
TargetCyclin-K/Cyclin-dependent kinase 12(Homo sapiens (Human))
Kinnate Biopharma
US Patent
LigandPNGBDBM478989((R)-N-(4-(3-((5-chloropyrimidin-2- yl)amino)pyrrol...)
Affinity DataIC50:  550nM. Assay description: The IC50 profile of test compounds was determined using three protein kinases. IC50 values were measured by testing 10 concentrations (1×10−04M...
Ligand InfoPC cidPC sid
In DepthDetails US Patent
TargetCyclin-dependent kinase 12(Homo sapiens)
Kinnate Biopharma
US Patent
LigandPNGBDBM478989((R)-N-(4-(3-((5-chloropyrimidin-2- yl)amino)pyrrol...)
Affinity DataIC50: <100nM. Assay description: For the assays, 5 μl solution from each well of the compound dilution plates/10% DMSO were transferred into the assay plates. The final volume o...
Ligand InfoPC cidPC sid
In DepthDetails US Patent