BDBM479039 (R)-N-(2-methyl-4-(3-((5- (trifluoromethyl)pyrimidin-2- yl)amino)pyrrolidine-1- carbonyl)phenyl)acrylamide::US10894788, Example 79::US11390618, Example 79
SMILES Cc1cc(ccc1NC(=O)C=C)C(=O)N1CC[C@H](C1)Nc1ncc(cn1)C(F)(F)F
InChI Key InChIKey=UKTDKTYPCHWKDL-OAHLLOKOSA-N
Data  2 IC50
  Tab Delimited (TSV)   2D SDfile   Computed 3D by Vconf -m prep SDfile
Find this compound or compounds like it in BindingDB:
Activity Spreadsheet -- Enzyme Inhibition Constant Data from BindingDB
Found 2 hits for monomerid = 479039
TargetCyclin-K/Cyclin-dependent kinase 12(Homo sapiens (Human))
Kinnate Biopharma
US Patent
LigandPNGBDBM479039((R)-N-(2-methyl-4-(3-((5- (trifluoromethyl)pyrimid...)
Affinity DataIC50: <100nM. Assay description: The IC50 profile of compounds was determined using one protein kinase in a customized, thiol free assay. IC50 values were measured by testing 10 conc...
Ligand InfoPC cidPC sid
In DepthDetails US Patent
TargetCyclin-dependent kinase 12(Homo sapiens)
Kinnate Biopharma
US Patent
LigandPNGBDBM479039((R)-N-(2-methyl-4-(3-((5- (trifluoromethyl)pyrimid...)
Affinity DataIC50: <100nM. Assay description: For the assays, 5 μl solution from each well of the compound dilution plates/10% DMSO were transferred into the assay plates. The final volume o...
Ligand InfoPC cidPC sid
In DepthDetails US Patent