BDBM479048 (R)-N-(4-(3-((5-chloro-4-(2- methoxyethoxy)pyrimidin-2- yl)amino)pyrrolidine-1- carbonyl)phenyl)acrylamide::US10894788, Example 88::US11390618, Example 88
SMILES COCCOc1nc(N[C@@H]2CCN(C2)C(=O)c2ccc(NC(=O)C=C)cc2)ncc1Cl
InChI Key InChIKey=MRELGEYFJGINCG-MRXNPFEDSA-N
Data  2 IC50
  Tab Delimited (TSV)   2D SDfile   Computed 3D by Vconf -m prep SDfile
Find this compound or compounds like it in BindingDB:
Activity Spreadsheet -- Enzyme Inhibition Constant Data from BindingDB
Found 2 hits for monomerid = 479048
TargetCyclin-K/Cyclin-dependent kinase 12(Homo sapiens (Human))
Kinnate Biopharma
US Patent
LigandPNGBDBM479048((R)-N-(4-(3-((5-chloro-4-(2- methoxyethoxy)pyrimid...)
Affinity DataIC50: <100nM. Assay description: The IC50 profile of test compounds was determined using three protein kinases. IC50 values were measured by testing 10 concentrations (1×10−04M...
Ligand InfoPC cidPC sid
In DepthDetails US Patent
TargetCyclin-dependent kinase 12(Homo sapiens)
Kinnate Biopharma
US Patent
LigandPNGBDBM479048((R)-N-(4-(3-((5-chloro-4-(2- methoxyethoxy)pyrimid...)
Affinity DataIC50: <100nM. Assay description: The IC50 profile of compounds was determined using one protein kinase in a customized, thiol free assay. IC50 values were measured by testing 10 conc...
Ligand InfoPC cidPC sid
In DepthDetails US Patent