BDBM479102 N-(4-((R)-3-((5-chloro-4- methoxypyrimidin-2- yl)amino)pyrrolidine-1- carbonyl)phenyl)oxirane-2- carboxamide::US10894788, Example 142::US11390618, Example 142
SMILES COc1nc(N[C@@H]2CCN(C2)C(=O)c2ccc(NC(=O)C3CO3)cc2)ncc1Cl
InChI Key InChIKey=MKUPUHXOADTVMZ-AFYYWNPRSA-N
Data  2 IC50
  Tab Delimited (TSV)   2D SDfile   Computed 3D by Vconf -m prep SDfile
Find this compound or compounds like it in BindingDB:
Activity Spreadsheet -- Enzyme Inhibition Constant Data from BindingDB
Found 2 hits for monomerid = 479102
TargetCyclin-K/Cyclin-dependent kinase 12(Homo sapiens (Human))
Kinnate Biopharma
US Patent
LigandPNGBDBM479102(N-(4-((R)-3-((5-chloro-4- methoxypyrimidin-2- yl)a...)
Affinity DataIC50:  5.50E+3nM. Assay description: The IC50 profile of test compounds was determined using three protein kinases. IC50 values were measured by testing 10 concentrations (1×10−04M...
Ligand InfoPC cidPC sid
In DepthDetails US Patent
TargetCyclin-dependent kinase 12(Homo sapiens)
Kinnate Biopharma
US Patent
LigandPNGBDBM479102(N-(4-((R)-3-((5-chloro-4- methoxypyrimidin-2- yl)a...)
Affinity DataIC50:  5.50E+3nM. Assay description: The IC50 profile of compounds was determined using one protein kinase in a customized, thiol free assay. IC50 values were measured by testing 10 conc...
Ligand InfoPC cidPC sid
In DepthDetails US Patent