BDBM47929 2-(3-amino-3-oxopropyl)-3-(3-nitrobenzoyl)-2H-indazole 1-oxide::3-[3-(3-nitrobenzoyl)-1-oxido-indazol-1-ium-2-yl]propionamide::3-[3-(3-nitrobenzoyl)-1-oxidoindazol-1-ium-2-yl]propanamide::3-[3-(3-nitrophenyl)carbonyl-1-oxidanidyl-indazol-1-ium-2-yl]propanamide::3-[3-[(3-nitrophenyl)-oxomethyl]-1-oxido-2-indazol-1-iumyl]propanamide::MLS001097214::SMR000718360::cid_24819986
SMILES NC(=O)CCn1c(C(=O)c2cccc(c2)[N+]([O-])=O)c2ccccc2[n+]1[O-]
InChI Key InChIKey=WWGLGPKEOMZMNA-UHFFFAOYSA-N
Data  1 IC50
  Tab Delimited (TSV)   2D SDfile   Computed 3D by Vconf -m prep SDfile
Find this compound or compounds like it in BindingDB:
Activity Spreadsheet -- Enzyme Inhibition Constant Data from BindingDB
Found 1 hit for monomerid = 47929
Target3C-like protease(Avian infectious bronchitis virus)
The Scripps Research Institute Molecular Screening Center
Curated by PubChem BioAssay
LigandPNGBDBM47929(2-(3-amino-3-oxopropyl)-3-(3-nitrobenzoyl)-2H-inda...)
Affinity DataIC50:  1.53E+4nM. Assay description: Source (MLPCN Center Name): The Scripps Research Institute Molecular Screening Center (SRIMSC) Center Affiliation: The Scripps Research Institute (TS...
In DepthDetails PCBioAssay