BDBM479382 US10894807, ID P065
SMILES OC(=O)CC[C@H](NC(=O)N[C@@H](Cc1ccc(NC(=O)CCCn2cc(CCCF)nn2)cc1)C(O)=O)C(O)=O
InChI Key InChIKey=OMJMYEMMWRXQTE-OALUTQOASA-N
Data  2 KI
  Tab Delimited (TSV)   2D SDfile   Computed 3D by Vconf -m prep SDfile
Find this compound or compounds like it in BindingDB:
Activity Spreadsheet -- Enzyme Inhibition Constant Data from BindingDB
Found 2 hits for monomerid = 479382
TargetGlutamate carboxypeptidase 2(Homo sapiens (Human))
Siemens Medical Solutions Usa
US Patent
LigandPNGBDBM479382(US10894807, ID P065)
Affinity DataKi:  9.10nM. Assay description: The inhibitory activity of all compounds was determined using a fluorescent assay of human PSMA activity. The enzyme used in the assay was purchased ...
Ligand InfoPC cidPC sid
In DepthDetails US Patent
TargetGlutamate carboxypeptidase 2(Homo sapiens (Human))
Siemens Medical Solutions Usa
US Patent
LigandPNGBDBM479382(US10894807, ID P065)
Affinity DataKi:  19.7nM. Assay description: The inhibitory activity of all compounds was determined using a fluorescent assay of human PSMA activity. The enzyme used in the assay was purchased ...
Ligand InfoPC cidPC sid
In DepthDetails US Patent