BDBM479398 US10894807, ID P156
SMILES CN([C@@H](CCCCNC(=O)c1ccc(F)cc1)C(O)=O)C(=O)N[C@@H](CCC(O)=O)C(O)=O
InChI Key InChIKey=YCXPXMKIQCJXNN-GJZGRUSLSA-N
Data  1 KI
  Tab Delimited (TSV)   2D SDfile   Computed 3D by Vconf -m prep SDfile
Find this compound or compounds like it in BindingDB:
Activity Spreadsheet -- Enzyme Inhibition Constant Data from BindingDB
Found 1 hit for monomerid = 479398
TargetGlutamate carboxypeptidase 2(Homo sapiens (Human))
Siemens Medical Solutions Usa
US Patent
LigandPNGBDBM479398(US10894807, ID P156)
Affinity DataKi:  219nM. Assay description: The inhibitory activity of all compounds was determined using a fluorescent assay of human PSMA activity. The enzyme used in the assay was purchased ...
Ligand InfoPC cidPC sid
In DepthDetails US Patent