BDBM479419 US10894807, ID P204
SMILES OC(=O)CC[C@H](NC(=O)N[C@@H](COCc1ccccc1)C(O)=O)C(O)=O
InChI Key InChIKey=PWDDLGNMTHZOLH-RYUDHWBXSA-N
Data  1 KI
  Tab Delimited (TSV)   2D SDfile   Computed 3D by Vconf -m prep SDfile
Find this compound or compounds like it in BindingDB:
Activity Spreadsheet -- Enzyme Inhibition Constant Data from BindingDB
Found 1 hit for monomerid = 479419
TargetGlutamate carboxypeptidase 2(Homo sapiens (Human))
Siemens Medical Solutions Usa
US Patent
LigandPNGBDBM479419(US10894807, ID P204)
Affinity DataKi:  6.90nM. Assay description: The inhibitory activity of all compounds was determined using a fluorescent assay of human PSMA activity. The enzyme used in the assay was purchased ...
Ligand InfoPC cidPC sid
In DepthDetails US Patent